pBr-C6H4CH2 anion

Reaction thermochemistry data

Data compiled by: John E. Bartmess

Individual Reactions

C7H6Br- + Hydrogen cation = Benzene, 1-bromo-4-methyl-

By formula: C7H6Br- + H+ = C7H7Br

Quantity Value Units Method Reference Comment
Δr373.8 ± 3.1kcal/molG+TSWenthold, Wierschke, et al., 1994gas phase; Between MeOCH2CH2OH and tBuCH2OH, near CH2Cl2
Quantity Value Units Method Reference Comment
Δr366.5 ± 3.0kcal/molIMRBWenthold, Wierschke, et al., 1994gas phase; Between MeOCH2CH2OH and tBuCH2OH, near CH2Cl2

References

Wenthold, Wierschke, et al., 1994
Wenthold, P.G.; Wierschke, S.G.; Nash, J.J.; Squires, R.R., Biradical thermochemistry from collision-induced dissociation threshold energy measurements .2. Experimental and theoretical studies of the Mechanism and Thermochemistry of Formation of alph, J. Am. Chem. Soc., 1994, 116, 16, 7378, https://doi.org/10.1021/ja00095a048 . [all data]