2-CHO-1-cyclopropanide anion

Reaction thermochemistry data

Data compiled by: John E. Bartmess

Individual Reactions

C4H5O- + Hydrogen cation = Cyclopropanecarboxaldehyde

By formula: C4H5O- + H+ = C4H6O

Quantity Value Units Method Reference Comment
Δr1631. ± 21.kJ/molG+TSBaschky, Peterson, et al., 1994gas phase; Between D2O and PhF. Cis and Trans anions do not interconvert and have same expt. acidity.
Quantity Value Units Method Reference Comment
Δr1598. ± 21.kJ/molIMRBBaschky, Peterson, et al., 1994gas phase; Between D2O and PhF. Cis and Trans anions do not interconvert and have same expt. acidity.

Gas phase ion energetics data

Data compiled by: John E. Bartmess

Protonation reactions

C4H5O- + Hydrogen cation = Cyclopropanecarboxaldehyde

By formula: C4H5O- + H+ = C4H6O

Quantity Value Units Method Reference Comment
Δr1631. ± 21.kJ/molG+TSBaschky, Peterson, et al., 1994gas phase; Between D2O and PhF. Cis and Trans anions do not interconvert and have same expt. acidity.
Quantity Value Units Method Reference Comment
Δr1598. ± 21.kJ/molIMRBBaschky, Peterson, et al., 1994gas phase; Between D2O and PhF. Cis and Trans anions do not interconvert and have same expt. acidity.

References

Baschky, Peterson, et al., 1994
Baschky, M.C.; Peterson, K.C.; Kass, S.R., Stereospecificity in the gas phase. Formation and characterization of configurationally stable cyclopropyl anions, J. Am. Chem. Soc., 1994, 116, 16, 7218, https://doi.org/10.1021/ja00095a026 . [all data]