Anisole, 3,5-dimethyl-4-nitro- anion

Gas phase thermochemistry data

Data compiled by: John E. Bartmess

Quantity Value Units Method Reference Comment
Δfgas410. ± 13.kJ/molR-EAChen, Cooks, et al., 1996

References

Chen, Cooks, et al., 1996
Chen, G.; Cooks, R.G.; Corpuz, E.; Scott, L.T., Estimation of the Electron Affinities of C60, Corannulene, and Coronene by Using the Kinetic Method, J. Am. Soc. Mass Spectrom., 1996, 7, 7, 619, https://doi.org/10.1016/1044-0305(96)85610-8 . [all data]