undecafluoro-1-norbornanide anion

Gas phase ion energetics data

Data compiled by: John E. Bartmess

Protonation reactions

C7F11- + Hydrogen cation = C7HF11

By formula: C7F11- + H+ = C7HF11

Quantity Value Units Method Reference Comment
Δr342.1 ± 2.1kcal/molG+TSKoppel, Pihl, et al., 1994gas phase
Quantity Value Units Method Reference Comment
Δr334.4 ± 2.0kcal/molIMREKoppel, Pihl, et al., 1994gas phase

References

Koppel, Pihl, et al., 1994
Koppel, I.A.; Pihl, V.; Koppel, I.A.; Anvia, F.; Taft, R.W., Thermodynamic acidity of (CF3)3CH and 1H-undecafluorobicyclo[2.2.1]heptane: The concept of anionic (fluorine) hyperconjugation, J. Am. Chem. Soc., 1994, 116, 19, 8654, https://doi.org/10.1021/ja00098a027 . [all data]