(N2O)4..NO anion

Gas phase ion energetics data

Data compiled by: John E. Bartmess

Electron affinity of neutral species

EAneutral (eV) Method Reference Comment
0.9460 ± 0.0030LPESHendricks, de Clercq, et al., 2002
0.640 ± 0.010LPESVelarde, Habteyes, et al., 2007Stated electron affinity is the Vertical Detachment Energy

References

Hendricks, de Clercq, et al., 2002
Hendricks, J.H.; de Clercq, H.L.; Freidhoff, C.B.; Arnold, S.T.; Eaton, J.G.; Fancher, C.; Lyapustina, S.A.; S., Anion solvation at the microscopic level: Photoelectron spectroscopy of the solvated anion clusters, NO-(Y)(n), where Y=Ar, Kr, Xe, N2O, H2S, NH3, H2O, and C2H4(OH)(2), J. Chem. Phys., 2002, 116, 18, 7926-7938, https://doi.org/10.1063/1.1457444 . [all data]

Velarde, Habteyes, et al., 2007
Velarde, L.; Habteyes, T.; Grumbling, E.R.; Pichugin, K.; Sanov, A., Solvent resonance effect on the anisotropy of NO-(N2O)(n) cluster anion photodetachment, J. Chem. Phys., 2007, 127, 8, 084302, https://doi.org/10.1063/1.2766948 . [all data]