(N2O)3..NO anion

Gas phase thermochemistry data

Data compiled by: John E. Bartmess

Quantity Value Units Method Reference Comment
Δfgas63.5 ± 1.6kcal/molTherHendricks, de Clercq, et al., 2002
Δfgas63.6 ± 1.3kcal/molTherHiraoka, Fujimaki, et al., 1994

Gas phase ion energetics data

Data compiled by: John E. Bartmess

Electron affinity of neutral species

EAneutral (eV) Method Reference Comment
0.7290 ± 0.0030LPESHendricks, de Clercq, et al., 2002
0.440 ± 0.010LPESVelarde, Habteyes, et al., 2007Stated electron affinity is the Vertical Detachment Energy

References

Hendricks, de Clercq, et al., 2002
Hendricks, J.H.; de Clercq, H.L.; Freidhoff, C.B.; Arnold, S.T.; Eaton, J.G.; Fancher, C.; Lyapustina, S.A.; S., Anion solvation at the microscopic level: Photoelectron spectroscopy of the solvated anion clusters, NO-(Y)(n), where Y=Ar, Kr, Xe, N2O, H2S, NH3, H2O, and C2H4(OH)(2), J. Chem. Phys., 2002, 116, 18, 7926-7938, https://doi.org/10.1063/1.1457444 . [all data]

Hiraoka, Fujimaki, et al., 1994
Hiraoka, K.; Fujimaki, S.; Aruga, K.; Yamabe, S., Gas-phase clustering reactions of O2(-), NO-, and O- with N2O: Isomeric structures for (NO-N2O)(-), J. Phys. Chem., 1994, 98, 34, 8295, https://doi.org/10.1021/j100085a006 . [all data]

Velarde, Habteyes, et al., 2007
Velarde, L.; Habteyes, T.; Grumbling, E.R.; Pichugin, K.; Sanov, A., Solvent resonance effect on the anisotropy of NO-(N2O)(n) cluster anion photodetachment, J. Chem. Phys., 2007, 127, 8, 084302, https://doi.org/10.1063/1.2766948 . [all data]