(N2O)2..O2 radical anion

Gas phase thermochemistry data

Data compiled by: John E. Bartmess

Quantity Value Units Method Reference Comment
Δfgas6.37kcal/molTherHiraoka, Fujimaki, et al., 1994

References

Hiraoka, Fujimaki, et al., 1994
Hiraoka, K.; Fujimaki, S.; Aruga, K.; Yamabe, S., Gas-phase clustering reactions of O2(-), NO-, and O- with N2O: Isomeric structures for (NO-N2O)(-), J. Phys. Chem., 1994, 98, 34, 8295, https://doi.org/10.1021/j100085a006 . [all data]