(CS2)2..F anion

Gas phase thermochemistry data

Data compiled by: John E. Bartmess

Quantity Value Units Method Reference Comment
Δfgas-190. ± 6.3kJ/molTherHiraoka, Fujimaki, et al., 1993

References

Hiraoka, Fujimaki, et al., 1993
Hiraoka, K.; Fujimaki, S.; Aruga, K.; Yamabe, S., Bond Strengths of the Gas-Phase Cluster Ions X-(CS2)n (X = F, Cl, Br and I), Chem. Phys. Lett., 1993, 208, 5-6, 491, https://doi.org/10.1016/0009-2614(93)87178-6 . [all data]