platinum hexafluoride anion

Gas phase thermochemistry data

Data compiled by: John E. Bartmess

Quantity Value Units Method Reference Comment
Δfgas-323. ± 10.kcal/molR-EAKorobov, Kuznetsov, et al., 19892PtF4 + 2AlF4- <=> 2AlF3 + PtF4- + PtF6-, ΔH = 29.4±1.0 kcal/mol.; value altered from reference due to conversion from electron convention to ion convention

References

Korobov, Kuznetsov, et al., 1989
Korobov, M.V.; Kuznetsov, S.V.; Sidorov, L.N.; Shipachev, V.A.; Mit'kin, V.N., Gas Phase Negative Ions of Platinum Metal Fluorides. II. Electron Affinity of Platinum Metal Hexafluorides, Int. J. Mass Spectrom. Ion Proc., 1989, 87, 1, 13, https://doi.org/10.1016/0168-1176(89)80002-3 . [all data]