(MeOH)4..Cl anion

Gas phase thermochemistry data

Data compiled by: John E. Bartmess

Quantity Value Units Method Reference Comment
Δfgas-1255.6kJ/molTherHiraoka and Mizuse, 1987
Δfgas-1255.6kJ/molTherEvans and Keesee, 1991
Δfgas-1258.5kJ/molTherYamdagni, Payzant, et al., 1973

References

Hiraoka and Mizuse, 1987
Hiraoka, K.; Mizuse, S., Gas-Phase Solvation of Cl- with H2O, CH3OH, C2H4OH, i-C3H7OH, n-C3H7OH, and t-C4H9OH, Chem. Phys., 1987, 118, 3, 457, https://doi.org/10.1016/0301-0104(87)85078-4 . [all data]

Evans and Keesee, 1991
Evans, D.H.; Keesee, R.G., Thermodynamics of Gas-Phase Mixed-Solvent Cluster Ions - Water and Methanol on K+ and Cl- and Comparison to Liquid Solutions, J. Phys. Chem., 1991, 95, 9, 3558, https://doi.org/10.1021/j100162a024 . [all data]

Yamdagni, Payzant, et al., 1973
Yamdagni, R.; Payzant, J.D.; Kebarle, P., Solvation of Cl- and O2- with H2O, CH3OH, and CH3CN in the gas phase, Can. J. Chem., 1973, 51, 2507. [all data]