(H2O)4..Cl anion

Gas phase thermochemistry data

Data compiled by: John E. Bartmess

Quantity Value Units Method Reference Comment
Δfgas-1405.1kJ/molTherHiraoka and Mizuse, 1987
Δfgas-1401.3kJ/molTherMarkovich, Pollack, et al., 1994For photodissociation plus electron loss. Affinity is difference from lower solvated ion.
Δfgas-1406.4kJ/molTherKeesee and Castleman, 1980
Δfgas-1407.2kJ/molTherArshadi, Yamdagni, et al., 1970

Gas phase ion energetics data

Data compiled by: John E. Bartmess

Electron affinity of neutral species

EAneutral (eV) Method Reference Comment
5.92 ± 0.10LPESMarkovich, Pollack, et al., 1994For photodissociation plus electron loss. Affinity is difference from lower solvated ion.

References

Hiraoka and Mizuse, 1987
Hiraoka, K.; Mizuse, S., Gas-Phase Solvation of Cl- with H2O, CH3OH, C2H4OH, i-C3H7OH, n-C3H7OH, and t-C4H9OH, Chem. Phys., 1987, 118, 3, 457, https://doi.org/10.1016/0301-0104(87)85078-4 . [all data]

Markovich, Pollack, et al., 1994
Markovich, G.; Pollack, S.; Giniger, R.; Cheshnovsky, O., Photoelectron spectroscopy of Cl-, Br-, and I- solvated in water clusters, J. Chem. Phys., 1994, 101, 11, 9344, https://doi.org/10.1063/1.467965 . [all data]

Keesee and Castleman, 1980
Keesee, R.G.; Castleman, A.W., Jr., Gas phase studies of hydration complexes of Cl- and I- and comparison to electrostatic calculations in the gas phase, Chem. Phys. Lett., 1980, 74, 139. [all data]

Arshadi, Yamdagni, et al., 1970
Arshadi, M.; Yamdagni, R.; Kebarle, P., Hydration of Halide Negative Ions in the Gas Phase. II. Comparison of Hydration Energies for the Alkali Positive and Halide Negative Ions, J. Phys. Chem., 1970, 74, 7, 1475, https://doi.org/10.1021/j100702a014 . [all data]