Tungsten hexafluoride anion

Gas phase thermochemistry data

Data compiled by: John E. Bartmess

Quantity Value Units Method Reference Comment
Δfgas-2046. ± 21.kJ/molR-EAViggiano, Paulson, et al., 1985
Δfgas-2061. ± 25.kJ/molIMREGeorge and Beauchamp, 1979EA: > F-, < Cl-

References

Viggiano, Paulson, et al., 1985
Viggiano, A.A.; Paulson, J.F.; Dale, F.; Henchman, M.; Adams, N.G.; Smith, D., Ion chemistry and electon affinity of WF6, J. Phys. Chem., 1985, 89, 2264. [all data]

George and Beauchamp, 1979
George, P.M.; Beauchamp, J.L., The electron and fluoride affinites of tungsten hexafluoride by ICR spectroscopy, Chem. Phys., 1979, 36, 345. [all data]