HOCH2CH2CH2OH..Cl anion

Gas phase thermochemistry data

Data compiled by: John E. Bartmess

Quantity Value Units Method Reference Comment
Δfgas-753.71kJ/molTherZhang, Beglinger, et al., 1995

References

Zhang, Beglinger, et al., 1995
Zhang, W.; Beglinger, C.; Stone, J.A., High-pressure mass spectrometric study of the gas-phase association of Cl- with alpha,omega-diols, J. Phys. Chem., 1995, 99, 30, 11673, https://doi.org/10.1021/j100030a009 . [all data]