nPnCH(Me)O anion

Reaction thermochemistry data

Data compiled by: John E. Bartmess

Individual Reactions

C7H15O- + Hydrogen cation = 2-Heptanol

By formula: C7H15O- + H+ = C7H16O

Quantity Value Units Method Reference Comment
Δr1558. ± 8.4kJ/molCIDCHaas and Harrison, 1993gas phase; Both metastable and 50 eV collision energy.
Quantity Value Units Method Reference Comment
Δr1531. ± 8.8kJ/molH-TSHaas and Harrison, 1993gas phase; Both metastable and 50 eV collision energy.

References

Haas and Harrison, 1993
Haas, M.J.; Harrison, A.G., The Fragmentation of Proton-Bound Cluster Ions and the Gas-Phase Acidities of Alcohols, Int. J. Mass Spectrom. Ion Proc., 1993, 124, 2, 115, https://doi.org/10.1016/0168-1176(93)80003-W . [all data]