1-Me-cC6H10-O anion

Reaction thermochemistry data

Data compiled by: John E. Bartmess

Individual Reactions

C7H13O- + Hydrogen cation = Cyclohexanol, 1-methyl-

By formula: C7H13O- + H+ = C7H14O

Quantity Value Units Method Reference Comment
Δr1556. ± 8.4kJ/molCIDCHaas and Harrison, 1993gas phase; Both metastable and 50 eV collision energy.
Quantity Value Units Method Reference Comment
Δr1528. ± 8.8kJ/molH-TSHaas and Harrison, 1993gas phase; Both metastable and 50 eV collision energy.

Gas phase ion energetics data

Data compiled by: John E. Bartmess

Electron affinity of neutral species

EAneutral (eV) Method Reference Comment
1.98 ± 0.12D-EAHaas and Harrison, 1993Both metastable and 50 eV collision energy.

Protonation reactions

C7H13O- + Hydrogen cation = Cyclohexanol, 1-methyl-

By formula: C7H13O- + H+ = C7H14O

Quantity Value Units Method Reference Comment
Δr1556. ± 8.4kJ/molCIDCHaas and Harrison, 1993gas phase; Both metastable and 50 eV collision energy.
Quantity Value Units Method Reference Comment
Δr1528. ± 8.8kJ/molH-TSHaas and Harrison, 1993gas phase; Both metastable and 50 eV collision energy.

References

Haas and Harrison, 1993
Haas, M.J.; Harrison, A.G., The Fragmentation of Proton-Bound Cluster Ions and the Gas-Phase Acidities of Alcohols, Int. J. Mass Spectrom. Ion Proc., 1993, 124, 2, 115, https://doi.org/10.1016/0168-1176(93)80003-W . [all data]