PbBr radical anion

Gas phase thermochemistry data

Data compiled by: John E. Bartmess

Quantity Value Units Method Reference Comment
Δfgas-22. ± 28.kJ/molR-EAHastie, Bloom, et al., 1967From PbBr2

References

Hastie, Bloom, et al., 1967
Hastie, J.W.; Bloom, H.; Morrison, J.D., Electron Impact Studies of PbCl2, PbBr2, and PbBrCl, J. Chem. Phys., 1967, 47, 5, 158, https://doi.org/10.1063/1.1712136 . [all data]