m-Chlorobenzaldehyde anion

Gas phase thermochemistry data

Data compiled by: John E. Bartmess

Quantity Value Units Method Reference Comment
Δfgas-131. ± 9.2kJ/molR-EAMishima, Huh, et al., 1993ΔGea(343 K)=-16.0 kcal/mol. Reanchored to EA(PhNO2), Kebarle and Chowdhury, 1987.

References

Mishima, Huh, et al., 1993
Mishima, M.; Huh, C.; Nakamura, H.; Fujio, M.; Tsuno, Y., Electron Affinities of Benzaldehydes. Substituent Effects on Stabilities of Aromatic Radical Anions., Tetrahed. Lett., 1993, 34, 26, 4223, https://doi.org/10.1016/S0040-4039(00)60533-6 . [all data]

Kebarle and Chowdhury, 1987
Kebarle, P.; Chowdhury, S., Electron affinities and electron transfer reactions, Chem. Rev., 1987, 87, 513. [all data]