B2H3 anion

Reaction thermochemistry data

Data compiled by: John E. Bartmess

Individual Reactions

H3B2- + Hydrogen cation = H4B2

By formula: H3B2- + H+ = H4B2

Quantity Value Units Method Reference Comment
Δr1537. ± 21.kJ/molG+TSKrempp, Damrauer, et al., 1994gas phase; Between tBuOH, pyrrole
Quantity Value Units Method Reference Comment
Δr1506. ± 21.kJ/molIMRBKrempp, Damrauer, et al., 1994gas phase; Between tBuOH, pyrrole

Gas phase ion energetics data

Data compiled by: John E. Bartmess

Electron affinity of neutral species

EAneutral (eV) Method Reference Comment
0.94 ± 0.25D-EAKrempp, Damrauer, et al., 1994Between tBuOH, pyrrole

Protonation reactions

H3B2- + Hydrogen cation = H4B2

By formula: H3B2- + H+ = H4B2

Quantity Value Units Method Reference Comment
Δr367.3 ± 5.1kcal/molG+TSKrempp, Damrauer, et al., 1994gas phase; Between tBuOH, pyrrole
Quantity Value Units Method Reference Comment
Δr360.0 ± 5.0kcal/molIMRBKrempp, Damrauer, et al., 1994gas phase; Between tBuOH, pyrrole

References

Krempp, Damrauer, et al., 1994
Krempp, M.; Damrauer, R.; Depuy, C.H.; Keheyan, Y., Gas-Phase Ion Chemistry of Boron Hydride Anions, J. Am. Chem. Soc., 1994, 116, 8, 3629, https://doi.org/10.1021/ja00087a071 . [all data]