SF6..SF5 anion

Gas phase thermochemistry data

Data compiled by: John E. Bartmess

Quantity Value Units Method Reference Comment
Δfgas>-589.75kcal/molTherHiraoka, Shimizu, et al., 1995No formation at 141 K

References

Hiraoka, Shimizu, et al., 1995
Hiraoka, K.; Shimizu, A.; Minamitsu, A.; Nasu, M.; Fujimaki, S.; Yamabe, S., The small binding energies of the negative cluster ions: SF5-(SF6)1, SF6-(SF6)1 and F-(SF6)n (n=1 and 2), in the gas phase, Chem. Phys. Lett., 1995, 241, 5-6, 623, https://doi.org/10.1016/0009-2614(95)00676-U . [all data]