CO..V(CO)5 anion

Reaction thermochemistry data

Data compiled by: John E. Bartmess

Individual Reactions

C5O5V- + Carbon monoxide = C6O6V-

By formula: C5O5V- + CO = C6O6V-

Quantity Value Units Method Reference Comment
Δr30.8 ± 3.5kcal/molCIDTSunderlin, Wang, et al., 1993gas phase

Ion clustering data

Data compiled by: John E. Bartmess

Clustering reactions

C5O5V- + Carbon monoxide = C6O6V-

By formula: C5O5V- + CO = C6O6V-

Quantity Value Units Method Reference Comment
Δr30.8 ± 3.5kcal/molCIDTSunderlin, Wang, et al., 1993gas phase

References

Sunderlin, Wang, et al., 1993
Sunderlin, L.S.; Wang, D.N.; Squires, R.R., Bond Strengths in 1st-Row-Metal Carbonyl Anions, J. Am. Chem. Soc., 1993, 115, 25, 12060, https://doi.org/10.1021/ja00078a051 . [all data]