CO..V(CO)4 anion

Gas phase thermochemistry data

Data compiled by: John E. Bartmess

Quantity Value Units Method Reference Comment
Δfgas-780.57kJ/molTherSunderlin, Wang, et al., 1993

Reaction thermochemistry data

Data compiled by: John E. Bartmess

Individual Reactions

C4O4V- + Carbon monoxide = C5O5V-

By formula: C4O4V- + CO = C5O5V-

Quantity Value Units Method Reference Comment
Δr130. ± 13.kJ/molCIDTSunderlin, Wang, et al., 1993gas phase

C5O5V- + Carbon monoxide = C6O6V-

By formula: C5O5V- + CO = C6O6V-

Quantity Value Units Method Reference Comment
Δr129. ± 15.kJ/molCIDTSunderlin, Wang, et al., 1993gas phase

Ion clustering data

Data compiled by: John E. Bartmess

Clustering reactions

C4O4V- + Carbon monoxide = C5O5V-

By formula: C4O4V- + CO = C5O5V-

Quantity Value Units Method Reference Comment
Δr130. ± 13.kJ/molCIDTSunderlin, Wang, et al., 1993gas phase

C5O5V- + Carbon monoxide = C6O6V-

By formula: C5O5V- + CO = C6O6V-

Quantity Value Units Method Reference Comment
Δr129. ± 15.kJ/molCIDTSunderlin, Wang, et al., 1993gas phase

References

Sunderlin, Wang, et al., 1993
Sunderlin, L.S.; Wang, D.N.; Squires, R.R., Bond Strengths in 1st-Row-Metal Carbonyl Anions, J. Am. Chem. Soc., 1993, 115, 25, 12060, https://doi.org/10.1021/ja00078a051 . [all data]