Tin(IV) chloride anion

Gas phase thermochemistry data

Data compiled by: John E. Bartmess

Quantity Value Units Method Reference Comment
Δfgas-691. ± 19.kJ/molR-EALacmann, Maneira, et al., 1983

References

Lacmann, Maneira, et al., 1983
Lacmann, K.; Maneira, M.J.P.; Moutinho, A.M.C.; Weigman, U., Total and Double Differential Cross Sections of Ion- Pair Formations in Collisions of K Atoms with SnCl4 and CCl4, J. Chem. Phys., 1983, 78, 1767. [all data]