H2O..{SO2}2..SO2 radical anion

Gas phase thermochemistry data

Data compiled by: John E. Bartmess

Quantity Value Units Method Reference Comment
Δfgas-1404.4 ± 1.9kJ/molTherVacher, Leduc, et al., 1994

References

Vacher, Leduc, et al., 1994
Vacher, J.R.; Leduc, E.; Fitaire, M., Stabilities of Anionic Mixed Clusters of Sulfur Dioxide and Water, Int. J. Mass Spectrom. Ion Proc., 1994, 135, 2-3, 139, https://doi.org/10.1016/0168-1176(94)03985-2 . [all data]