(SO2)5..SO2 radical anion

Gas phase thermochemistry data

Data compiled by: John E. Bartmess

Quantity Value Units Method Reference Comment
Δfgas-2088.9 ± 2.5kJ/molTherVacher, Jorda, et al., 1992

References

Vacher, Jorda, et al., 1992
Vacher, J.R.; Jorda, M.; Leduc, E.; Fitaire, M., A Determination of the Stabilities of Negative Ion Clusters in SO2 and SO2-O2 Mixtures, Int. J. Mass Spectrom. Ion Proc., 1992, 114, 3, 149, https://doi.org/10.1016/0168-1176(92)80033-W . [all data]