Iodine anion

Gas phase thermochemistry data

Data compiled by: John E. Bartmess

Quantity Value Units Method Reference Comment
Δfgas-43.29 ± 0.12kcal/molR-EAZanni, Taylor, et al., 1997

References

Zanni, Taylor, et al., 1997
Zanni, M.T.; Taylor, T.R.; Greenblatt, J.; Soep, B.; Neumark, D.M., Characterization of the I2- Anion Ground State Using Conventional and Femtosecond Photoelectron Spectroscopy, J. Chem. Phys., 1997, 107, 19, 7613, https://doi.org/10.1063/1.475110 . [all data]