2,5-diMe-benzoate anion

Gas phase ion energetics data

Data compiled by: John E. Bartmess

Electron affinity of neutral species

EAneutral (eV) Method Reference Comment
3.78 ± 0.16D-EADecouzon, Ertl, et al., 1993relative to benzoate at 333.0 kcal/mol

Protonation reactions

C9H9O2- + Hydrogen cation = Benzoic acid, 2,5-dimethyl-

By formula: C9H9O2- + H+ = C9H10O2

Quantity Value Units Method Reference Comment
Δr339.5 ± 2.1kcal/molG+TSDecouzon, Ertl, et al., 1993gas phase; relative to benzoate at 333.0 kcal/mol
Quantity Value Units Method Reference Comment
Δr332.5 ± 2.0kcal/molIMREDecouzon, Ertl, et al., 1993gas phase; relative to benzoate at 333.0 kcal/mol

References

Decouzon, Ertl, et al., 1993
Decouzon, M.; Ertl, P.; Exner, O.; Gal, J.F.; Maria, P.C., Concepts of Sterically Hindered Resonance and Buttressing Effect - Gas-Phase Acidities of Methyl-Substituted Benzoic Acids and Basicities of, J. Am. Chem. Soc., 1993, 115, 25, 12071, https://doi.org/10.1021/ja00078a052 . [all data]