europium (III) chloride, anhydrous anion

Gas phase thermochemistry data

Data compiled by: John E. Bartmess

Quantity Value Units Method Reference Comment
Δfgas-234.2 ± 3.4kcal/molTherKudin, Burdukovskaya, et al., 1993

References

Kudin, Burdukovskaya, et al., 1993
Kudin, L.S.; Burdukovskaya, G.G.; Butman, M.F.; Krasnov, K.S., Mass-Spectrometric Determination of EuCl2-, EuCl3-, EuCl4- and Eu2Cl7- Gaseous Ion Formation Enthalpies, Zh. Fiz. Khim. SSSR, 1993, 67, 645. [all data]