cyclooctatetraene..Fe(CO)3 anion

Gas phase ion energetics data

Data compiled by: John E. Bartmess

Electron affinity of neutral species

EAneutral (eV) Method Reference Comment
1.2879 ± 0.0087TDEqSharpe and Kebarle, 1993ΔGea(373 K)= -33.0 kcal/mol; ΔSea= -8.7 eu

References

Sharpe and Kebarle, 1993
Sharpe, P.; Kebarle, P., Electron Affinities, Enthalpy, and Entropy of Electron Attachment of Several eta-4-(Olefin)Fe(CO)3 Complexes and Electron-Transfer Kinetics, J. Am. Chem. Soc., 1993, 115, 2, 782, https://doi.org/10.1021/ja00055a059 . [all data]