(H2O)2..1,5-naphthalene-diSO3 dianion

Reaction thermochemistry data

Data compiled by: John E. Bartmess

Individual Reactions

C10H8O7S2-2 + 2Water = C10H10O8S2-2

By formula: C10H8O7S2-2 + 2H2O = C10H10O8S2-2

Quantity Value Units Method Reference Comment
Δr7.00 ± 0.30kcal/molTDAsBlades, Klassen, et al., 1995gas phase

C10H10O8S2-2 + 3Water = C10H12O9S2-2

By formula: C10H10O8S2-2 + 3H2O = C10H12O9S2-2

Quantity Value Units Method Reference Comment
Δr6.30 ± 0.30kcal/molTDAsBlades, Klassen, et al., 1995gas phase

References

Blades, Klassen, et al., 1995
Blades, A.T.; Klassen, J.S.; Kebarle, P., Free Energies of Hydration in the Gas Phase on the Anions of Some Oxo Acids of C, N, S, P, Cl and I, J. Am. Chem. Soc., 1995, 117, 42, 10563, https://doi.org/10.1021/ja00147a019 . [all data]