(H2O)5..O3SSSSO3 dianion

Reaction thermochemistry data

Data compiled by: John E. Bartmess

Individual Reactions

H8O10S4-2 + 5Water = H10O11S4-2

By formula: H8O10S4-2 + 5H2O = H10O11S4-2

Quantity Value Units Method Reference Comment
Δr22.6 ± 1.3kJ/molTDAsBlades, Klassen, et al., 1995gas phase

References

Blades, Klassen, et al., 1995
Blades, A.T.; Klassen, J.S.; Kebarle, P., Free Energies of Hydration in the Gas Phase on the Anions of Some Oxo Acids of C, N, S, P, Cl and I, J. Am. Chem. Soc., 1995, 117, 42, 10563, https://doi.org/10.1021/ja00147a019 . [all data]