H2O..O3SSSSO3 dianion

Reaction thermochemistry data

Data compiled by: John E. Bartmess

Individual Reactions

CAS Reg. No. 15536-54-6 + Water = H2O7S4-2

By formula: CAS Reg. No. 15536-54-6 + H2O = H2O7S4-2

Quantity Value Units Method Reference Comment
Δr9.10 ± 0.30kcal/molTDAsBlades, Klassen, et al., 1995gas phase

H2O7S4-2 + 2Water = H4O8S4-2

By formula: H2O7S4-2 + 2H2O = H4O8S4-2

Quantity Value Units Method Reference Comment
Δr7.80 ± 0.30kcal/molTDAsBlades, Klassen, et al., 1995gas phase

References

Blades, Klassen, et al., 1995
Blades, A.T.; Klassen, J.S.; Kebarle, P., Free Energies of Hydration in the Gas Phase on the Anions of Some Oxo Acids of C, N, S, P, Cl and I, J. Am. Chem. Soc., 1995, 117, 42, 10563, https://doi.org/10.1021/ja00147a019 . [all data]