(H2O)3..O3SOOSO3 dianion

Reaction thermochemistry data

Data compiled by: John E. Bartmess

Individual Reactions

H4O10S2-2 + 3Water = H6O11S2-2

By formula: H4O10S2-2 + 3H2O = H6O11S2-2

Quantity Value Units Method Reference Comment
Δr31.4 ± 1.3kJ/molTDAsBlades, Klassen, et al., 1995gas phase

H6O11S2-2 + 4Water = H8O12S2-2

By formula: H6O11S2-2 + 4H2O = H8O12S2-2

Quantity Value Units Method Reference Comment
Δr28.0 ± 1.3kJ/molTDAsBlades, Klassen, et al., 1995gas phase

References

Blades, Klassen, et al., 1995
Blades, A.T.; Klassen, J.S.; Kebarle, P., Free Energies of Hydration in the Gas Phase on the Anions of Some Oxo Acids of C, N, S, P, Cl and I, J. Am. Chem. Soc., 1995, 117, 42, 10563, https://doi.org/10.1021/ja00147a019 . [all data]