(H2O)3..O3SCH2CH2SO3 dianion

Reaction thermochemistry data

Data compiled by: John E. Bartmess

Individual Reactions

C2H8O8S2-2 + 3Water = C2H10O9S2-2

By formula: C2H8O8S2-2 + 3H2O = C2H10O9S2-2

Quantity Value Units Method Reference Comment
Δr7.50 ± 0.30kcal/molTDAsBlades, Klassen, et al., 1995gas phase

C2H10O9S2-2 + 4Water = C2H12O10S2-2

By formula: C2H10O9S2-2 + 4H2O = C2H12O10S2-2

Quantity Value Units Method Reference Comment
Δr6.60 ± 0.30kcal/molTDAsBlades, Klassen, et al., 1995gas phase

References

Blades, Klassen, et al., 1995
Blades, A.T.; Klassen, J.S.; Kebarle, P., Free Energies of Hydration in the Gas Phase on the Anions of Some Oxo Acids of C, N, S, P, Cl and I, J. Am. Chem. Soc., 1995, 117, 42, 10563, https://doi.org/10.1021/ja00147a019 . [all data]