(H2O)2..O3SCH2CH2SO3 dianion

Reaction thermochemistry data

Data compiled by: John E. Bartmess

Individual Reactions

CAS Reg. No. 56383-76-7 + 2Water = C2H8O8S2-2

By formula: CAS Reg. No. 56383-76-7 + 2H2O = C2H8O8S2-2

Quantity Value Units Method Reference Comment
Δr36.4 ± 1.3kJ/molTDAsBlades, Klassen, et al., 1995gas phase

C2H8O8S2-2 + 3Water = C2H10O9S2-2

By formula: C2H8O8S2-2 + 3H2O = C2H10O9S2-2

Quantity Value Units Method Reference Comment
Δr31.4 ± 1.3kJ/molTDAsBlades, Klassen, et al., 1995gas phase

References

Blades, Klassen, et al., 1995
Blades, A.T.; Klassen, J.S.; Kebarle, P., Free Energies of Hydration in the Gas Phase on the Anions of Some Oxo Acids of C, N, S, P, Cl and I, J. Am. Chem. Soc., 1995, 117, 42, 10563, https://doi.org/10.1021/ja00147a019 . [all data]