(H2O)6..O3SSO3 dianion

Reaction thermochemistry data

Data compiled by: John E. Bartmess

Individual Reactions

H10O11S2-2 + 6Water = H12O12S2-2

By formula: H10O11S2-2 + 6H2O = H12O12S2-2

Quantity Value Units Method Reference Comment
Δr26.4 ± 1.3kJ/molTDAsBlades, Klassen, et al., 1995gas phase

H12O12S2-2 + 7Water = H14O13S2-2

By formula: H12O12S2-2 + 7H2O = H14O13S2-2

Quantity Value Units Method Reference Comment
Δr23.4 ± 1.3kJ/molTDAsBlades, Klassen, et al., 1995gas phase

References

Blades, Klassen, et al., 1995
Blades, A.T.; Klassen, J.S.; Kebarle, P., Free Energies of Hydration in the Gas Phase on the Anions of Some Oxo Acids of C, N, S, P, Cl and I, J. Am. Chem. Soc., 1995, 117, 42, 10563, https://doi.org/10.1021/ja00147a019 . [all data]