(H2O)4..O3SSO3 dianion

Reaction thermochemistry data

Data compiled by: John E. Bartmess

Individual Reactions

H6O9S2-2 + 4Water = H8O10S2-2

By formula: H6O9S2-2 + 4H2O = H8O10S2-2

Quantity Value Units Method Reference Comment
Δr33.5 ± 1.3kJ/molTDAsBlades, Klassen, et al., 1995gas phase

H8O10S2-2 + 5Water = H10O11S2-2

By formula: H8O10S2-2 + 5H2O = H10O11S2-2

Quantity Value Units Method Reference Comment
Δr29.7 ± 1.3kJ/molTDAsBlades, Klassen, et al., 1995gas phase

Ion clustering data

Data compiled by: John E. Bartmess

Clustering reactions

H6O9S2-2 + 4Water = H8O10S2-2

By formula: H6O9S2-2 + 4H2O = H8O10S2-2

Quantity Value Units Method Reference Comment
Δr33.5 ± 1.3kJ/molTDAsBlades, Klassen, et al., 1995gas phase

H8O10S2-2 + 5Water = H10O11S2-2

By formula: H8O10S2-2 + 5H2O = H10O11S2-2

Quantity Value Units Method Reference Comment
Δr29.7 ± 1.3kJ/molTDAsBlades, Klassen, et al., 1995gas phase

References

Blades, Klassen, et al., 1995
Blades, A.T.; Klassen, J.S.; Kebarle, P., Free Energies of Hydration in the Gas Phase on the Anions of Some Oxo Acids of C, N, S, P, Cl and I, J. Am. Chem. Soc., 1995, 117, 42, 10563, https://doi.org/10.1021/ja00147a019 . [all data]