(H2O)7..S2O3 dianion

Ion clustering data

Data compiled by: John E. Bartmess

Clustering reactions

H12O9S2-2 + 7Water = H14O10S2-2

By formula: H12O9S2-2 + 7H2O = H14O10S2-2

Quantity Value Units Method Reference Comment
Δr27.2 ± 1.3kJ/molTDAsBlades, Klassen, et al., 1995gas phase

H14O10S2-2 + 8Water = H16O11S2-2

By formula: H14O10S2-2 + 8H2O = H16O11S2-2

Quantity Value Units Method Reference Comment
Δr24.7 ± 1.3kJ/molTDAsBlades, Klassen, et al., 1995gas phase

References

Blades, Klassen, et al., 1995
Blades, A.T.; Klassen, J.S.; Kebarle, P., Free Energies of Hydration in the Gas Phase on the Anions of Some Oxo Acids of C, N, S, P, Cl and I, J. Am. Chem. Soc., 1995, 117, 42, 10563, https://doi.org/10.1021/ja00147a019 . [all data]