(H2O)5..S2O3 dianion

Reaction thermochemistry data

Data compiled by: John E. Bartmess

Individual Reactions

CAS Reg. No. 14383-50-7 + 5Water = H10O8S2-2

By formula: CAS Reg. No. 14383-50-7 + 5H2O = H10O8S2-2

Quantity Value Units Method Reference Comment
Δr34.7 ± 1.3kJ/molTDAsBlades, Klassen, et al., 1995gas phase

H10O8S2-2 + 6Water = H12O9S2-2

By formula: H10O8S2-2 + 6H2O = H12O9S2-2

Quantity Value Units Method Reference Comment
Δr30.5 ± 1.3kJ/molTDAsBlades, Klassen, et al., 1995gas phase

Ion clustering data

Data compiled by: John E. Bartmess

Clustering reactions

H10O8S2-2 + 6Water = H12O9S2-2

By formula: H10O8S2-2 + 6H2O = H12O9S2-2

Quantity Value Units Method Reference Comment
Δr30.5 ± 1.3kJ/molTDAsBlades, Klassen, et al., 1995gas phase

References

Blades, Klassen, et al., 1995
Blades, A.T.; Klassen, J.S.; Kebarle, P., Free Energies of Hydration in the Gas Phase on the Anions of Some Oxo Acids of C, N, S, P, Cl and I, J. Am. Chem. Soc., 1995, 117, 42, 10563, https://doi.org/10.1021/ja00147a019 . [all data]