(H2O)7..SeO4 dianion

Reaction thermochemistry data

Data compiled by: John E. Bartmess

Individual Reactions

H12O10Se-2 + 7Water = H14O11Se-2

By formula: H12O10Se-2 + 7H2O = H14O11Se-2

Quantity Value Units Method Reference Comment
Δr29.3 ± 1.3kJ/molTDAsBlades, Klassen, et al., 1995gas phase

H14O11Se-2 + 8Water = H16O12Se-2

By formula: H14O11Se-2 + 8H2O = H16O12Se-2

Quantity Value Units Method Reference Comment
Δr26.4 ± 1.3kJ/molTDAsBlades, Klassen, et al., 1995gas phase

Ion clustering data

Data compiled by: John E. Bartmess

Clustering reactions

H12O10Se-2 + 7Water = H14O11Se-2

By formula: H12O10Se-2 + 7H2O = H14O11Se-2

Quantity Value Units Method Reference Comment
Δr29.3 ± 1.3kJ/molTDAsBlades, Klassen, et al., 1995gas phase

H14O11Se-2 + 8Water = H16O12Se-2

By formula: H14O11Se-2 + 8H2O = H16O12Se-2

Quantity Value Units Method Reference Comment
Δr26.4 ± 1.3kJ/molTDAsBlades, Klassen, et al., 1995gas phase

References

Blades, Klassen, et al., 1995
Blades, A.T.; Klassen, J.S.; Kebarle, P., Free Energies of Hydration in the Gas Phase on the Anions of Some Oxo Acids of C, N, S, P, Cl and I, J. Am. Chem. Soc., 1995, 117, 42, 10563, https://doi.org/10.1021/ja00147a019 . [all data]