(H2O)10..SO4 dianion

Reaction thermochemistry data

Data compiled by: John E. Bartmess

Individual Reactions

H18O13S-2 + 10Water = H20O14S-2

By formula: H18O13S-2 + 10H2O = H20O14S-2

Quantity Value Units Method Reference Comment
Δr45.6 ± 8.4kJ/molTDAsBlades and Kebarle, 2005gas phase
Quantity Value Units Method Reference Comment
Δr24. ± 8.4kJ/molTDAsBlades and Kebarle, 2005gas phase

H20O14S-2 + 11Water = H22O15S-2

By formula: H20O14S-2 + 11H2O = H22O15S-2

Quantity Value Units Method Reference Comment
Δr45.6 ± 8.4kJ/molTDAsBlades and Kebarle, 2005gas phase
Quantity Value Units Method Reference Comment
Δr22. ± 8.4kJ/molTDAsBlades and Kebarle, 2005gas phase

Gas phase ion energetics data

Data compiled by: John E. Bartmess

Electron affinity of neutral species

EAneutral (eV) Method Reference Comment
2.93 ± 0.10LPESWang, Nicholas, et al., 2000Vertical Detachment Energy: 3.33±0.10 eV.

References

Blades and Kebarle, 2005
Blades, A.T.; Kebarle, P., Sequential hydration energies of the sulfate ion, from determinations of the equilibrium constants for the gas-phase reactions: SO4(H2O)(n)(2-) = SO4(H2O)(n-1)(2-)+H2O, J. Phys. Chem. A, 2005, 109, 37, 8293-8298, https://doi.org/10.1021/jp0540353 . [all data]