(H2O)3..1,4-O2C-C6H4-CO2 dianion

Reaction thermochemistry data

Data compiled by: John E. Bartmess

Individual Reactions

CAS Reg. No. 3198-30-9 + 3Water = C8H10O7-2

By formula: CAS Reg. No. 3198-30-9 + 3H2O = C8H10O7-2

Quantity Value Units Method Reference Comment
Δr35.1 ± 1.3kJ/molTDAsBlades, Klassen, et al., 1995gas phase

C8H10O7-2 + 4Water = C8H12O8-2

By formula: C8H10O7-2 + 4H2O = C8H12O8-2

Quantity Value Units Method Reference Comment
Δr30.5 ± 1.3kJ/molTDAsBlades, Klassen, et al., 1995gas phase

References

Blades, Klassen, et al., 1995
Blades, A.T.; Klassen, J.S.; Kebarle, P., Free Energies of Hydration in the Gas Phase on the Anions of Some Oxo Acids of C, N, S, P, Cl and I, J. Am. Chem. Soc., 1995, 117, 42, 10563, https://doi.org/10.1021/ja00147a019 . [all data]