(H2O)4..O2C(CH2)7CO2 dianion

Reaction thermochemistry data

Data compiled by: John E. Bartmess

Individual Reactions

C9H20O7-2 + 4Water = C9H22O8-2

By formula: C9H20O7-2 + 4H2O = C9H22O8-2

Quantity Value Units Method Reference Comment
Δr28.9 ± 1.3kJ/molTDAsBlades, Klassen, et al., 1995gas phase

C9H22O8-2 + 5Water = C9H24O9-2

By formula: C9H22O8-2 + 5H2O = C9H24O9-2

Quantity Value Units Method Reference Comment
Δr24.7 ± 1.3kJ/molTDAsBlades, Klassen, et al., 1995gas phase

Ion clustering data

Data compiled by: John E. Bartmess

Clustering reactions

C9H20O7-2 + 4Water = C9H22O8-2

By formula: C9H20O7-2 + 4H2O = C9H22O8-2

Quantity Value Units Method Reference Comment
Δr6.90 ± 0.30kcal/molTDAsBlades, Klassen, et al., 1995gas phase

C9H22O8-2 + 5Water = C9H24O9-2

By formula: C9H22O8-2 + 5H2O = C9H24O9-2

Quantity Value Units Method Reference Comment
Δr5.90 ± 0.30kcal/molTDAsBlades, Klassen, et al., 1995gas phase

References

Blades, Klassen, et al., 1995
Blades, A.T.; Klassen, J.S.; Kebarle, P., Free Energies of Hydration in the Gas Phase on the Anions of Some Oxo Acids of C, N, S, P, Cl and I, J. Am. Chem. Soc., 1995, 117, 42, 10563, https://doi.org/10.1021/ja00147a019 . [all data]