(H2O)3..O2C(CH2)7CO2 dianion

Reaction thermochemistry data

Data compiled by: John E. Bartmess

Individual Reactions

CAS Reg. No. 13479-16-8 + 3Water = C9H20O7-2

By formula: CAS Reg. No. 13479-16-8 + 3H2O = C9H20O7-2

Quantity Value Units Method Reference Comment
Δr31.8 ± 1.3kJ/molTDAsBlades, Klassen, et al., 1995gas phase

C9H20O7-2 + 4Water = C9H22O8-2

By formula: C9H20O7-2 + 4H2O = C9H22O8-2

Quantity Value Units Method Reference Comment
Δr28.9 ± 1.3kJ/molTDAsBlades, Klassen, et al., 1995gas phase

References

Blades, Klassen, et al., 1995
Blades, A.T.; Klassen, J.S.; Kebarle, P., Free Energies of Hydration in the Gas Phase on the Anions of Some Oxo Acids of C, N, S, P, Cl and I, J. Am. Chem. Soc., 1995, 117, 42, 10563, https://doi.org/10.1021/ja00147a019 . [all data]