rhenium trioxide anion

Gas phase thermochemistry data

Data compiled by: John E. Bartmess

Quantity Value Units Method Reference Comment
Δfgas-137.1 ± 9.6kcal/molTDEqGould and Miller, 1975

References

Gould and Miller, 1975
Gould, B.K.; Miller, W.J., Electron attachment and compound formation in flames. VI. Negative ion and compound formation in flames containing rhenium and potassium, J. Chem. Phys., 1975, 62, 644. [all data]