(H2O)3..benzoate anion

Gas phase thermochemistry data

Data compiled by: John E. Bartmess

Quantity Value Units Method Reference Comment
Δfgas-1291. ± 15.kJ/molTherBlades, Klassen, et al., 1995T: 293 K. ΔSaff approx. 24 cal/mol-K

References

Blades, Klassen, et al., 1995
Blades, A.T.; Klassen, J.S.; Kebarle, P., Free Energies of Hydration in the Gas Phase on the Anions of Some Oxo Acids of C, N, S, P, Cl and I, J. Am. Chem. Soc., 1995, 117, 42, 10563, https://doi.org/10.1021/ja00147a019 . [all data]