(H2O)3..MeCO2 anion

Gas phase thermochemistry data

Data compiled by: John E. Bartmess

Quantity Value Units Method Reference Comment
Δfgas-334.5 ± 3.5kcal/molTherMeot-ner, Elmore, et al., 1999
Δfgas-334.9 ± 3.6kcal/molTherBlades, Klassen, et al., 1995T: 293 K. ΔSaff approx. 24 cal/mol-K

References

Meot-ner, Elmore, et al., 1999
Meot-ner, M.; Elmore, D.E.; Scheiner, S., Ionic Hydrogen Bond Effects on the Acidities, Basicities, Solvation, Solvent Bridging and Self-assembly of Carboxylic Groups, J. Am. Chem. Soc., 1999, 121, 33, 7625, https://doi.org/10.1021/ja982173i . [all data]

Blades, Klassen, et al., 1995
Blades, A.T.; Klassen, J.S.; Kebarle, P., Free Energies of Hydration in the Gas Phase on the Anions of Some Oxo Acids of C, N, S, P, Cl and I, J. Am. Chem. Soc., 1995, 117, 42, 10563, https://doi.org/10.1021/ja00147a019 . [all data]