(H2O)2..C7H15SO3 anion

Reaction thermochemistry data

Data compiled by: John E. Bartmess

Individual Reactions

C7H17O4S- + 2Water = C7H19O5S-

By formula: C7H17O4S- + 2H2O = C7H19O5S-

Quantity Value Units Method Reference Comment
Δr12.0 ± 1.5kcal/molTDAsBlades, Klassen, et al., 1995gas phase; T: 293 K. ΔSaff approx. 24 cal/mol-K
Quantity Value Units Method Reference Comment
Δr5.00 ± 0.30kcal/molTDAsBlades, Klassen, et al., 1995gas phase; T: 293 K. ΔSaff approx. 24 cal/mol-K

References

Blades, Klassen, et al., 1995
Blades, A.T.; Klassen, J.S.; Kebarle, P., Free Energies of Hydration in the Gas Phase on the Anions of Some Oxo Acids of C, N, S, P, Cl and I, J. Am. Chem. Soc., 1995, 117, 42, 10563, https://doi.org/10.1021/ja00147a019 . [all data]