(H2O)2..(HO)HPO2 anion

Reaction thermochemistry data

Data compiled by: John E. Bartmess

Individual Reactions

H4O4P- + 2Water = H6O5P-

By formula: H4O4P- + 2H2O = H6O5P-

Quantity Value Units Method Reference Comment
Δr13.6 ± 1.5kcal/molTDAsBlades, Klassen, et al., 1995gas phase; T: 293 K. ΔSaff approx. 24 cal/mol-K
Quantity Value Units Method Reference Comment
Δr6.60 ± 0.30kcal/molTDAsBlades, Klassen, et al., 1995gas phase; T: 293 K. ΔSaff approx. 24 cal/mol-K

H6O5P- + 3Water = H8O6P-

By formula: H6O5P- + 3H2O = H8O6P-

Quantity Value Units Method Reference Comment
Δr12.2 ± 1.5kcal/molTDAsBlades, Klassen, et al., 1995gas phase; T: 293 K. ΔSaff approx. 24 cal/mol-K
Quantity Value Units Method Reference Comment
Δr5.20 ± 0.30kcal/molTDAsBlades, Klassen, et al., 1995gas phase; T: 293 K. ΔSaff approx. 24 cal/mol-K

References

Blades, Klassen, et al., 1995
Blades, A.T.; Klassen, J.S.; Kebarle, P., Free Energies of Hydration in the Gas Phase on the Anions of Some Oxo Acids of C, N, S, P, Cl and I, J. Am. Chem. Soc., 1995, 117, 42, 10563, https://doi.org/10.1021/ja00147a019 . [all data]