(H2O)2..HO2C(CH2)3CO2 anion

Ion clustering data

Data compiled by: John E. Bartmess

Clustering reactions

C5H9O5- + 2Water = C5H11O6-

By formula: C5H9O5- + 2H2O = C5H11O6-

Quantity Value Units Method Reference Comment
Δr17.6 ± 1.3kJ/molTDAsBlades, Klassen, et al., 1995gas phase

References

Blades, Klassen, et al., 1995
Blades, A.T.; Klassen, J.S.; Kebarle, P., Free Energies of Hydration in the Gas Phase on the Anions of Some Oxo Acids of C, N, S, P, Cl and I, J. Am. Chem. Soc., 1995, 117, 42, 10563, https://doi.org/10.1021/ja00147a019 . [all data]