(H2O)2..HO2CCH2CO2 anion

Reaction thermochemistry data

Data compiled by: John E. Bartmess

Individual Reactions

C3H5O5- + 2Water = C3H7O6-

By formula: C3H5O5- + 2H2O = C3H7O6-

Quantity Value Units Method Reference Comment
Δr16.7 ± 1.3kJ/molTDAsBlades, Klassen, et al., 1995gas phase

Ion clustering data

Data compiled by: John E. Bartmess

Clustering reactions

C3H5O5- + 2Water = C3H7O6-

By formula: C3H5O5- + 2H2O = C3H7O6-

Quantity Value Units Method Reference Comment
Δr16.7 ± 1.3kJ/molTDAsBlades, Klassen, et al., 1995gas phase

References

Blades, Klassen, et al., 1995
Blades, A.T.; Klassen, J.S.; Kebarle, P., Free Energies of Hydration in the Gas Phase on the Anions of Some Oxo Acids of C, N, S, P, Cl and I, J. Am. Chem. Soc., 1995, 117, 42, 10563, https://doi.org/10.1021/ja00147a019 . [all data]